Target
Tyrosine-protein kinase receptor TYRO3
Ligand
BDBM50444068
Substrate
Meas. Tech.
ChEMBL_1279517 (CHEMBL3097236)
IC50
21±n/a nM
Citation
 Zhang, WZhang, DStashko, MADeRyckere, DHunter, DKireev, DMiley, MJCummings, CLee, MNorris-Drouin, JStewart, WMSather, SZhou, YKirkpatrick, GMachius, MJanzen, WPEarp, HSGraham, DKFrye, SVWang, X Pseudo-cyclization through intramolecular hydrogen bond enables discovery of pyridine substituted pyrimidines as new Mer kinase inhibitors. J Med Chem 56:9683-92 (2014)  
Target
Name:
Tyrosine-protein kinase receptor TYRO3
Synonyms:
BYK RSE TIF TYRO3_HUMAN | Tyrosine-protein kinase SKY
Type:
Protein
Mol. Mass.:
96894.13
Organism:
Homo sapiens (Human)
Description:
Q06418
Residue:
890
  
Inhibitor
Name:
BDBM50444068
Synonyms:
CHEMBL3092797
Type:
Small organic molecule
Emp. Form.:
C22H34N6O2
Mol. Mass.:
414.5444
SMILES:
CCCCNc1ncc(c(N[C@H]2CC[C@H](O)CC2)n1)-c1ccc(CNCCO)cn1
: