Target
Tyrosine-protein kinase receptor TYRO3
Ligand
BDBM50444072
Substrate
Meas. Tech.
ChEMBL_1279517 (CHEMBL3097236)
IC50
24±n/a nM
Citation
 Zhang, WZhang, DStashko, MADeRyckere, DHunter, DKireev, DMiley, MJCummings, CLee, MNorris-Drouin, JStewart, WMSather, SZhou, YKirkpatrick, GMachius, MJanzen, WPEarp, HSGraham, DKFrye, SVWang, X Pseudo-cyclization through intramolecular hydrogen bond enables discovery of pyridine substituted pyrimidines as new Mer kinase inhibitors. J Med Chem 56:9683-92 (2014)  
Target
Name:
Tyrosine-protein kinase receptor TYRO3
Synonyms:
BYK RSE TIF TYRO3_HUMAN | Tyrosine-protein kinase SKY
Type:
Protein
Mol. Mass.:
96894.13
Organism:
Homo sapiens (Human)
Description:
Q06418
Residue:
890
  
Inhibitor
Name:
BDBM50444072
Synonyms:
CHEMBL3092793
Type:
Small organic molecule
Emp. Form.:
C26H39N7O2
Mol. Mass.:
481.6336
SMILES:
CCCCNc1ncc(c(N[C@H]2CC[C@H](O)CC2)n1)-c1ccc(cn1)C(=O)NC1CCN(C)CC1
: