Target
Botulinum neurotoxin type A
Ligand
BDBM50444729
Substrate
Meas. Tech.
ChEMBL_1281779 (CHEMBL3100682)
IC50
>100000±n/a nM
Citation
 Williams, JDKhan, ARCardinale, SCButler, MMBowlin, TLPeet, NP Small molecule inhibitors of anthrax lethal factor toxin. Bioorg Med Chem 22:419-34 (2013)  
Target
Name:
Botulinum neurotoxin type A
Synonyms:
BXA1_CLOBO bonT | botA
Type:
PROTEIN
Mol. Mass.:
149450.01
Organism:
Clostridium botulinum
Description:
ChEMBL_1510137
Residue:
1296
  
Inhibitor
Name:
BDBM50444729
Synonyms:
CHEMBL87699
Type:
Small organic molecule
Emp. Form.:
C19H19N3O
Mol. Mass.:
305.3737
SMILES:
Cc1cc(N)c2cc(NC(=O)CCc3ccccc3)ccc2n1
: