Target
Neuronal acetylcholine receptor subunit alpha-3/alpha-6/beta-3
Ligand
BDBM50445330
Substrate
Meas. Tech.
ChEMBL_1285320 (CHEMBL3107570)
IC50
0.260000±n/a nM
Citation
 Luo, SZhangsun, DZhu, XWu, YHu, YChristensen, SHarvey, PJAkcan, MCraik, DJMcIntosh, JM Characterization of a novela-conotoxin TxID from Conus textile that potently blocks rata3ß4 nicotinic acetylcholine receptors. J Med Chem 56:9655-63 (2014)  
Target
Name:
Neuronal acetylcholine receptor subunit alpha-3/alpha-6/beta-3
Synonyms:
Nicotinic acetylcholine receptor alpha6/alpha3/beta2/beta3
Type:
Mol. Mass.:
Description:
ASSAY_ID of ChEMBL is 1285295
Components:
This complex has 4 components.
Component 1
Name:
Neuronal acetylcholine receptor subunit alpha-6
Synonyms:
ACHA6_RAT Chrna6 Neuronal acetylcholine receptor subunit alpha-6 | Neuronal acetylcholine receptor subunit alpha-6/beta-3
Type:
PROTEIN
Mol. Mass.:
56943.53
Organism:
Rattus norvegicus
Description:
ChEMBL_1454451
Residue:
493
  
Component 2
Name:
Neuronal acetylcholine receptor subunit alpha-3
Synonyms:
ACHA3_RAT Chrna3
Type:
Enzyme
Mol. Mass.:
56995.52
Organism:
Rattus norvegicus (Rat)
Description:
P04757
Residue:
499
  
Component 3
Name:
Neuronal acetylcholine receptor subunit beta-3
Synonyms:
ACHB3_RAT Chrnb3 | Neuronal acetylcholine receptor protein beta-3 subunit
Type:
PROTEIN
Mol. Mass.:
53270.05
Organism:
Rattus norvegicus
Description:
EBI_10644
Residue:
464
  
Component 4
Name:
Neuronal acetylcholine receptor subunit beta-3
Synonyms:
ACHB3_RAT Chrnb3 | Neuronal acetylcholine receptor protein beta-3 subunit
Type:
PROTEIN
Mol. Mass.:
53270.05
Organism:
Rattus norvegicus
Description:
EBI_10644
Residue:
464
  
Inhibitor
Name:
BDBM50445330
Synonyms:
CHEMBL3104243
Type:
Small organic molecule
Emp. Form.:
C54H82N14O16S4
Mol. Mass.:
1311.573
SMILES:
CC(C)C[C@@H]1NC(=O)[C@@H](NC(=O)[C@H](C)NC(=O)[C@@H]2CSSC[C@H](NC(=O)CN)C(=O)N[C@@H](CSSC[C@H](NC(=O)[C@H](Cc3ccc(O)cc3)NC1=O)C(N)=O)C(=O)N[C@@H](CO)C(=O)N[C@@H]([C@@H](C)O)C(=O)N1CCC[C@H]1C(=O)N1CCC[C@H]1C(=O)N2)C(C)C
: