Target
Nicotinic acetylcholine receptor alpha9/alpha10
Ligand
BDBM50445331
Substrate
Meas. Tech.
ChEMBL_1285311 (CHEMBL3107561)
IC50
>10000±n/a nM
Citation
 Luo, SZhangsun, DZhu, XWu, YHu, YChristensen, SHarvey, PJAkcan, MCraik, DJMcIntosh, JM Characterization of a novela-conotoxin TxID from Conus textile that potently blocks rata3ß4 nicotinic acetylcholine receptors. J Med Chem 56:9655-63 (2014)  
Target
Name:
Nicotinic acetylcholine receptor alpha9/alpha10
Synonyms:
Neuronal acetylcholine receptor subunit alpha-10/alpha-9
Type:
Mol. Mass.:
Description:
ASSAY_ID of ChEMBL is 2193071
Components:
This complex has 2 components.
Component 1
Name:
Neuronal acetylcholine receptor subunit alpha-9
Synonyms:
ACHA9_RAT Cholinergic, Nicotinic Muscle NACHR alpha 9 Nicotinic acetylcholine receptor subunit alpha 9
Type:
Enzyme Catalytic Domain
Mol. Mass.:
54522.69
Organism:
RAT
Description:
Cholinergic, Nicotinic Muscle 0 RAT::P43144
Residue:
479
  
Component 2
Name:
Neuronal acetylcholine receptor subunit alpha-10
Synonyms:
ACH10_RAT Neuronal acetylcholine receptor protein alpha-10 subunit | Nicotinic acetylcholine receptor alpha9/alpha10
Type:
PROTEIN
Mol. Mass.:
49830.54
Organism:
Rattus norvegicus
Description:
ChEMBL_143222
Residue:
447
  
Inhibitor
Name:
BDBM50445331
Synonyms:
CHEMBL3104245
Type:
Small organic molecule
Emp. Form.:
C58H92N18O18S5
Mol. Mass.:
1489.786
SMILES:
CC[C@H](C)[C@@H]1NC(=O)[C@@H]2CCCN2C(=O)[C@H](CO)NC(=O)[C@H](CCSC)NC(=O)[C@H](C)NC(=O)[C@H](CO)NC(=O)[C@@H]2CSSC[C@H](NC(=O)CN)C(=O)N[C@@H](CSSC[C@H](NC1=O)C(N)=O)C(=O)N[C@@H](CO)C(=O)N[C@@H](Cc1cnc[nH]1)C(=O)N1CCC[C@H]1C(=O)N[C@@H](C(C)C)C(=O)N2
: