Target
Neuromedin-K receptor
Ligand
BDBM50445820
Substrate
Meas. Tech.
ChEMBL_1284930 (CHEMBL3108371)
Ki
3981±n/a nM
Citation
 Hanessian, SBabonneau, VBoyer, NMannoury la Cour, CMillan, MJDe Nanteuil, G Design and synthesis of potential dual NK(1)/NK(3) receptor antagonists. Bioorg Med Chem Lett 24:510-4 (2014)  
Target
Name:
Neuromedin-K receptor
Synonyms:
NK-3 receptor NK3R NKR Neurokinin B receptor Neuromedin-3 receptor (NK-3R) Neuromedin-K receptor Neuromedin-K receptor (NK3) TAC3R Tachykinin receptor 3 | Tachykinin receptor 3 (NK3)
Type:
Enzyme
Mol. Mass.:
52221.96
Organism:
Homo sapiens (Human)
Description:
P29371
Residue:
465
  
Inhibitor
Name:
BDBM50445820
Synonyms:
CHEMBL3104783
Type:
Small organic molecule
Emp. Form.:
C31H31Cl3FN3O3
Mol. Mass.:
618.954
SMILES:
CN(Cc1ccc(Cl)cc1)C(=O)[C@@H](CCN1CCC2(CC1)OC(=O)N(C)c1ccc(F)cc21)c1ccc(Cl)c(Cl)c1
: