Target
Substance-P receptor
Ligand
BDBM50445816
Substrate
Meas. Tech.
ChEMBL_1284926 (CHEMBL3108367)
Ki
2512±n/a nM
Citation
 Hanessian, SBabonneau, VBoyer, NMannoury la Cour, CMillan, MJDe Nanteuil, G Design and synthesis of potential dual NK(1)/NK(3) receptor antagonists. Bioorg Med Chem Lett 24:510-4 (2014)  
Target
Name:
Substance-P receptor
Synonyms:
NK-1 receptor NK1 Receptor NK1R_HUMAN Neurokinin-1 (NK-1) SPR TACR1 Tachykinin receptor 1 (NK1) | tachykinin
Type:
G Protein-Coupled Receptor (GPCR)
Mol. Mass.:
46254.43
Organism:
Homo sapiens (Human)
Description:
P25103
Residue:
407
  
Inhibitor
Name:
BDBM50445816
Synonyms:
CHEMBL3104781
Type:
Small organic molecule
Emp. Form.:
C26H29F6N3O3
Mol. Mass.:
545.5172
SMILES:
CC(C)(C(=O)N[C@@H](C(=O)NCCN1CCOCC1)c1ccccc1)c1cc(cc(c1)C(F)(F)F)C(F)(F)F
: