Target
Lysine-specific histone demethylase 1A
Ligand
BDBM50446141
Substrate
Meas. Tech.
ChEMBL_1288156 (CHEMBL3110659)
Ki
5.0±n/a nM
Citation
 Kumarasinghe, IRWoster, PM Synthesis and evaluation of novel cyclic Peptide inhibitors of lysine-specific demethylase 1. ACS Med Chem Lett 5:29-33 (2014)  
Target
Name:
Lysine-specific histone demethylase 1A
Synonyms:
AOF2 Flavin-containing amine oxidase domain-containing protein 2 KDM1A KIAA0601 Lysine-specific demethylase 1 (LSD1) Lysine-specific histone demethylase 1 (LSD1)
Type:
Enzyme
Mol. Mass.:
92901.01
Organism:
Homo sapiens (Human)
Description:
O60341
Residue:
852
  
Inhibitor
Name:
BDBM50446141
Synonyms:
CHEMBL3108901
Type:
Small organic molecule
Emp. Form.:
C19H21NO2
Mol. Mass.:
295.3755
SMILES:
CC(N[C@H]1C[C@@H]1c1ccccc1)c1ccc2OCCOc2c1
: