Target
Kallikrein-7
Ligand
BDBM50446218
Substrate
Meas. Tech.
ChEMBL_1287998 (CHEMBL3110697)
Ki
1300±n/a nM
Citation
 Oliveira, JPFreitas, RFMelo, LSBarros, TGSantos, JAJuliano, MAPinheiro, SBlaber, MJuliano, LMuri, EMPuzer, L Isomannide-based peptidomimetics as inhibitors for human tissue kallikreins 5 and 7. ACS Med Chem Lett 5:128-32 (2014)  
Target
Name:
Kallikrein-7
Synonyms:
KLK7 Kallikrein 7 PRSS6 Serine protease 6 hK7 kallikrein-7 isoform 1 preproprotein
Type:
PROTEIN
Mol. Mass.:
27535.05
Organism:
Homo sapiens (Human)
Description:
ChEMBL_1469257
Residue:
253
  
Inhibitor
Name:
BDBM50446218
Synonyms:
CHEMBL3109166
Type:
Small organic molecule
Emp. Form.:
C29H35NO9
Mol. Mass.:
541.5895
SMILES:
CC(C)(C)OC(=O)N[C@@H](CC(=O)OCc1ccccc1)C(=O)O[C@@H]1CO[C@@H]2[C@@H](CO[C@H]12)OCc1ccccc1
: