Target
Proteinase-activated receptor 1
Ligand
BDBM50446344
Substrate
Meas. Tech.
ChEMBL_1286966 (CHEMBL3111131)
Ki
20±n/a nM
Citation
 Chelliah, MVChackalamannil, SXia, YGreenlee, WJAhn, HSKurowski, SBoykow, GHsieh, YChintala, M Himbacine-derived thrombin receptor antagonists: c7-aminomethyl and c9a-hydroxy analogues of vorapaxar. ACS Med Chem Lett 5:183-7 (2014)  
Target
Name:
Proteinase-activated receptor 1
Synonyms:
CF2R F2R PAR1 Proteinase activated receptor 1 TR Thrombin receptor/ Proteinase-activated receptor 1(Par-1)
Type:
Protein
Mol. Mass.:
47450.07
Organism:
Homo sapiens (Human)
Description:
P25116
Residue:
425
  
Inhibitor
Name:
BDBM50446344
Synonyms:
CHEMBL3109578
Type:
Small organic molecule
Emp. Form.:
C29H33FN2O5
Mol. Mass.:
508.5811
SMILES:
CCOC(=O)N[C@@H]1CC[C@@H]2[C@@H](C1)C[C@]1(O)[C@@H]([C@@H](C)OC1=O)[C@H]2C=Cc1ccc(cn1)-c1cccc(F)c1
: