Target
Histone-lysine N-methyltransferase EHMT2
Ligand
BDBM50446378
Substrate
Meas. Tech.
ChEMBL_1287119 (CHEMBL3111908)
IC50
0.900000±n/a nM
Citation
 Sweis, RFPliushchev, MBrown, PJGuo, JLi, FMaag, DPetros, AMSoni, NBTse, CVedadi, MMichaelides, MRChiang, GGPappano, WN Discovery and development of potent and selective inhibitors of histone methyltransferase g9a. ACS Med Chem Lett 5:205-9 (2014)  
Target
Name:
Histone-lysine N-methyltransferase EHMT2
Synonyms:
BAT8 EHMT2 G9A Histone-lysine N-methyltransferase EHMT1/EHMT2 KMT1C Protein G9a (G9a)
Type:
Enzyme
Mol. Mass.:
132339.87
Organism:
Homo sapiens (Human)
Description:
Q96KQ7
Residue:
1210
  
Inhibitor
Name:
BDBM50446378
Synonyms:
CHEMBL3109639
Type:
Small organic molecule
Emp. Form.:
C18H27N3O2
Mol. Mass.:
317.4259
SMILES:
COc1cc2c(cc1OCCCN1CCCC1)N=C(N)C2(C)C
: