Target
Polyunsaturated fatty acid 5-lipoxygenase
Ligand
BDBM50446689
Substrate
Meas. Tech.
ChEMBL_1290927 (CHEMBL3118900)
IC50
3500±n/a nM
Citation
 Prasher, PPooja, naSingh, P Lead modification: amino acid appended indoles as highly effective 5-LOX inhibitors. Bioorg Med Chem 22:1642-8 (2014)  
Target
Name:
Polyunsaturated fatty acid 5-lipoxygenase
Synonyms:
5-LO 5-Lipoxygenase (5-LO) 5-Lipoygenase ALOX5 LOG5 | LOX5_HUMAN
Type:
Enzyme
Mol. Mass.:
77972.74
Organism:
Homo sapiens (Human)
Description:
Recombinant protein was purified from E. coli lysate. After ammonium sulfate precipitation and subsequent steps, the supernatant (S100) was used for 5-LO activity assay.
Residue:
674
  
Inhibitor
Name:
BDBM50446689
Synonyms:
CHEMBL3113607
Type:
Small organic molecule
Emp. Form.:
C13H12N2O4
Mol. Mass.:
260.2454
SMILES:
COC(=O)CNC(=O)C(=O)c1c[nH]c2ccccc12
: