Target
C-C chemokine receptor type 2
Ligand
BDBM50446850
Substrate
Meas. Tech.
ChEMBL_1290263 (CHEMBL3118392)
IC50
18±n/a nM
Citation
 Cai, CMcComsey, DFHou, CO'Neill, JCOpas, EMcKenney, SJohnson, DSui, Z Discovery and SAR of 5-aminooctahydrocyclopentapyrrole-3a-carboxamides as potent CCR2 antagonists. Bioorg Med Chem Lett 24:1239-42 (2014)  
Target
Name:
C-C chemokine receptor type 2
Synonyms:
C-C chemokine receptor type 2 (CCR2) CCR2_HUMAN Chemoattractant Cytokine Receptor 2 (CCR2) Monocyte chemotactic protein-1 (MCP-1)
Type:
Enzyme
Mol. Mass.:
41932.32
Organism:
Homo sapiens (Human)
Description:
P41597
Residue:
374
  
Inhibitor
Name:
BDBM50446850
Synonyms:
CHEMBL3115109
Type:
Small organic molecule
Emp. Form.:
C28H38F3N5O6
Mol. Mass.:
597.6264
SMILES:
COC1COCCC1N[C@@H]1C[C@H]2CN(C[C@]2(C1)C(=O)N1CCc2ncc(cc2C1)C(F)(F)F)C(=O)OCCNC(C)=O
: