Target
Aldehyde dehydrogenase, dimeric NADP-preferring
Ligand
BDBM50447059
Substrate
Meas. Tech.
ChEMBL_1289633 (CHEMBL3118331)
IC50
900±n/a nM
Citation
 Parajuli, BFishel, MLHurley, TD Selective ALDH3A1 inhibition by benzimidazole analogues increase mafosfamide sensitivity in cancer cells. J Med Chem 57:449-61 (2014)  
Target
Name:
Aldehyde dehydrogenase, dimeric NADP-preferring
Synonyms:
AL3A1_HUMAN ALDH3A1 Aldehyde dehydrogenase family 3 member A1 (ALDH3A1) | Aldehyde dehydrogenase family 3 member A1 (ALDH3A1) (Q122A)
Type:
Protein
Mol. Mass.:
50394.38
Organism:
Homo sapiens (Human)
Description:
Residue:
453
  
Inhibitor
Name:
BDBM50447059
Synonyms:
CHEMBL3112689 | US9328112, A64
Type:
Small organic molecule
Emp. Form.:
C15H13ClN2O3S
Mol. Mass.:
336.793
SMILES:
COc1cc(ccc1Cl)S(=O)(=O)n1c(C)nc2ccccc12
: