Target
Aldehyde dehydrogenase, dimeric NADP-preferring
Ligand
BDBM50447062
Substrate
Meas. Tech.
ChEMBL_1289633 (CHEMBL3118331)
IC50
4200±n/a nM
Citation
 Parajuli, BFishel, MLHurley, TD Selective ALDH3A1 inhibition by benzimidazole analogues increase mafosfamide sensitivity in cancer cells. J Med Chem 57:449-61 (2014)  
Target
Name:
Aldehyde dehydrogenase, dimeric NADP-preferring
Synonyms:
AL3A1_HUMAN ALDH3A1 Aldehyde dehydrogenase family 3 member A1 (ALDH3A1) | Aldehyde dehydrogenase family 3 member A1 (ALDH3A1) (Q122A)
Type:
Protein
Mol. Mass.:
50394.38
Organism:
Homo sapiens (Human)
Description:
Residue:
453
  
Inhibitor
Name:
BDBM50447062
Synonyms:
CHEMBL3112687 | US9328112, B27
Type:
Small organic molecule
Emp. Form.:
C13H8F2N2O2S
Mol. Mass.:
294.277
SMILES:
Fc1ccc(cc1F)S(=O)(=O)n1cnc2ccccc12
: