Target
Aldehyde dehydrogenase, dimeric NADP-preferring
Ligand
BDBM50447075
Substrate
Meas. Tech.
ChEMBL_1289633 (CHEMBL3118331)
IC50
>100000±n/a nM
Citation
 Parajuli, BFishel, MLHurley, TD Selective ALDH3A1 inhibition by benzimidazole analogues increase mafosfamide sensitivity in cancer cells. J Med Chem 57:449-61 (2014)  
Target
Name:
Aldehyde dehydrogenase, dimeric NADP-preferring
Synonyms:
AL3A1_HUMAN ALDH3A1 Aldehyde dehydrogenase family 3 member A1 (ALDH3A1) | Aldehyde dehydrogenase family 3 member A1 (ALDH3A1) (Q122A)
Type:
Protein
Mol. Mass.:
50394.38
Organism:
Homo sapiens (Human)
Description:
Residue:
453
  
Inhibitor
Name:
BDBM50447075
Synonyms:
CHEMBL1729716 | US9328112, A16
Type:
Small organic molecule
Emp. Form.:
C15H13N3O3S
Mol. Mass.:
315.347
SMILES:
CC(=O)Nc1ccc(cc1)S(=O)(=O)n1cnc2ccccc12
: