Target
Calcitonin gene-related peptide type 1 receptor
Ligand
BDBM50447328
Substrate
Meas. Tech.
ChEMBL_1291533 (CHEMBL3118705)
Ki
0.070000±n/a nM
Citation
 Joshi, PAnderson, CBinch, HHadida, SYoo, SBergeron, DDecker, CterHaar, EMoore, JGarcia-Guzman, MTermin, A Identification of potent CNS-penetrant thiazolidinones as novel CGRP receptor antagonists. Bioorg Med Chem Lett 24:845-9 (2014)  
Target
Name:
Calcitonin gene-related peptide type 1 receptor
Synonyms:
Adrenomedullin receptor AM1; CALCRL/RAMP2 CALRL_HUMAN CGRP type 1 receptor mRNA Calcitonin gene-related peptide (CGRP) receptor Calcitonin receptor-like receptor Human CL receptor
Type:
Enzyme Catalytic Domain
Mol. Mass.:
52980.45
Organism:
Homo sapiens (Human)
Description:
Q16602
Residue:
461
  
Inhibitor
Name:
BDBM50447328
Synonyms:
CHEMBL3114494
Type:
Small organic molecule
Emp. Form.:
C37H51FN6O3S
Mol. Mass.:
678.903
SMILES:
CCN1CCN(CC1)c1c(F)cccc1C1SC(CC(=O)N2CCC(CC2)N2CCc3ccccc3NC2=O)C(=O)N1CCC(C)(C)C
: