Target
ALK tyrosine kinase receptor/Nucleophosmin
Ligand
BDBM50448040
Substrate
Meas. Tech.
ChEMBL_1289134 (CHEMBL3119007)
IC50
5600±n/a nM
Citation
 Tardy, SOrsato, AMologni, LBisson, WHDonadoni, CGambacorti-Passerini, CScapozza, LGueyrard, DGoekjian, PG Synthesis and biological evaluation of benzo[4,5]imidazo[1,2-c]pyrimidine and benzo[4,5]imidazo[1,2-a]pyrazine derivatives as anaplastic lymphoma kinase inhibitors. Bioorg Med Chem 22:1303-12 (2014)  
Target
Name:
ALK tyrosine kinase receptor/Nucleophosmin
Synonyms:
NPM/ALK (Nucleophosmin/ALK tyrosine kinase receptor)
Type:
Mol. Mass.:
Description:
ASSAY_ID of EBI is 331455
Components:
This complex has 2 components.
Component 1
Name:
ALK tyrosine kinase receptor
Synonyms:
ALK ALK_HUMAN CD_antigen: CD246
Type:
Protein
Mol. Mass.:
176453.10
Organism:
Homo sapiens (Human)
Description:
Q9UM73
Residue:
1620
  
Component 2
Name:
Nucleophosmin
Synonyms:
NPM NPM1 | NPM_HUMAN
Type:
PROTEIN
Mol. Mass.:
32552.99
Organism:
Homo sapiens (Human)
Description:
ChEMBL_1502715
Residue:
294
  
Component 3
Name:
ALK tyrosine kinase receptor
Synonyms:
ALK ALK_HUMAN CD_antigen: CD246
Type:
Protein
Mol. Mass.:
176453.10
Organism:
Homo sapiens (Human)
Description:
Q9UM73
Residue:
1620
  
Inhibitor
Name:
BDBM50448040
Synonyms:
CHEMBL3115496
Type:
Small organic molecule
Emp. Form.:
C16H11BrN4
Mol. Mass.:
339.189
SMILES:
Brc1ccc2nc3cc(Nc4ccccc4)ncn3c2c1
: