Target
Coagulation factor X
Ligand
BDBM50448610
Substrate
Meas. Tech.
ChEMBL_1296330 (CHEMBL3129589)
Ki
1100±n/a nM
Citation
 Quan, MLWong, PCWang, CWoerner, FSmallheer, JMBarbera, FABozarth, JMBrown, RLHarpel, MRLuettgen, JMMorin, PEPeterson, TRamamurthy, VRendina, ARRossi, KAWatson, CAWei, AZhang, GSeiffert, DWexler, RR Tetrahydroquinoline derivatives as potent and selective factor XIa inhibitors. J Med Chem 57:955-69 (2014)  
Target
Name:
Coagulation factor X
Synonyms:
Activated coagulation factor X (FXa) Coagulation factor X precursor F10 Factor X heavy chain Factor Xa Stuart-Prower factor
Type:
Enzyme
Mol. Mass.:
54726.60
Organism:
Homo sapiens (Human)
Description:
Residue:
488
  
Inhibitor
Name:
BDBM50448610
Synonyms:
CHEMBL3127464
Type:
Small organic molecule
Emp. Form.:
C34H34N4O3
Mol. Mass.:
546.6588
SMILES:
CC(C)CNC(=O)c1ccc(c(c1)C(O)=O)-c1ccccc1[C@@H]1C[C@H](c2ccccc2)c2cc(ccc2N1)C(N)=N
: