Target
Gag-Pol polyprotein [489-587]
Ligand
BDBM50000810
Substrate
Meas. Tech.
ChEMBL_158036 (CHEMBL768260)
Ki
0.22±n/a nM
Citation
 Doweyko, AM Three-dimensional pharmacophores from binding data. J Med Chem 37:1769-78 (1994)  
Target
Name:
Gag-Pol polyprotein [489-587]
Synonyms:
Human immunodeficiency virus type 1 protease Pol polyprotein | gag-pol
Type:
Enzyme Subunit
Mol. Mass.:
10781.16
Organism:
Human immunodeficiency virus type 1
Description:
P04585[489-587]
Residue:
99
  
Inhibitor
Name:
BDBM50000810
Synonyms:
CHEMBL299659
Type:
Small organic molecule
Emp. Form.:
C39H45N3O7
Mol. Mass.:
667.7905
SMILES:
CC(C)[C@H](NC(=O)OCc1ccccc1)C(=O)N[C@@H](Cc1ccccc1)[C@@H](O)[C@H](O)[C@H](Cc1ccccc1)NC(=O)OCc1ccccc1
: