Target
Carbonic anhydrase 2
Ligand
BDBM10865
Substrate
Meas. Tech.
ChEMBL_956003 (CHEMBL2380060)
Ki
70±n/a nM
Citation
 Vullo, DLuca, VDScozzafava, ACarginale, VRossi, MSupuran, CTCapasso, C The alpha-carbonic anhydrase from the thermophilic bacterium Sulfurihydrogenibium yellowstonense YO3AOP1 is highly susceptible to inhibition by sulfonamides. Bioorg Med Chem 21:1534-8 (2013)  
Target
Name:
Carbonic anhydrase 2
Synonyms:
CA-II CAC Carbonate dehydratase II Carbonic anhydrase 2 (CA-II) Carbonic anhydrase C Carbonic anhydrase II (CA-II) Carbonic anhydrase II (hCA II) | Carbonic anhydrase isoenzyme II (hCA II)
Type:
Enzyme
Mol. Mass.:
29250.71
Organism:
Homo sapiens (Human)
Description:
P00918
Residue:
260
  
Inhibitor
Name:
BDBM10865
Synonyms:
4-Amino-3-iodobenzenesulfonamide CHEMBL268177 halogenosulfanilamide deriv. 5e
Type:
Small organic molecule
Emp. Form.:
C6H7IN2O2S
Mol. Mass.:
298.101
SMILES:
Nc1ccc(cc1I)S(N)(=O)=O
: