Target
Neuronal acetylcholine receptor subunit alpha-3/beta-4
Ligand
BDBM50001701
Substrate
Meas. Tech.
ChEMBL_1337300 (CHEMBL3241024)
Ki
980±n/a nM
Citation
 Chang, YPBanerjee, JDowell, CWu, JGyanda, RHoughten, RAToll, LMcIntosh, JMArmishaw, CJ Discovery of a potent and selectivea3ß4 nicotinic acetylcholine receptor antagonist from ana-conotoxin synthetic combinatorial library. J Med Chem 57:3511-21 (2014)  
Target
Name:
Neuronal acetylcholine receptor subunit alpha-3/beta-4
Synonyms:
Neuronal acetylcholine receptor Alpha-3/Beta-4 Neuronal acetylcholine receptor; alpha3/beta4 | nAChR subtypes alpha3 beta4
Type:
Protein
Mol. Mass.:
Description:
Components:
This complex has 2 components.
Component 1
Name:
Neuronal acetylcholine receptor subunit alpha-3
Synonyms:
ACHA3_RAT Chrna3
Type:
Enzyme
Mol. Mass.:
56995.52
Organism:
Rattus norvegicus (Rat)
Description:
P04757
Residue:
499
  
Component 2
Name:
Neuronal acetylcholine receptor subunit beta-4
Synonyms:
ACHB4_RAT Chrnb4 Neuronal acetylcholine receptor non-alpha-2 chain | Neuronal acetylcholine receptor protein beta-4 subunit
Type:
Enzyme
Mol. Mass.:
55863.89
Organism:
Rattus norvegicus (Rat)
Description:
P12392
Residue:
495
  
Inhibitor
Name:
BDBM50001701
Synonyms:
CHEMBL3238086
Type:
Small organic molecule
Emp. Form.:
C59H85N13O16S4
Mol. Mass.:
1360.644
SMILES:
[H][C@@]12CCCN1C(=O)[C@H](CCCC)NC(=O)[C@H](CO)NC(=O)[C@]1([H])CSSC[C@H](NC(=O)[C@H](Cc3ccc(O)cc3)NC(=O)[C@H](CCC)NC(=O)[C@H](CC)NC(=O)[C@H](Cc3ccccc3)NC(=O)[C@]([H])(CSSC[C@H](NC(=O)CN)C(=O)N1)NC(=O)[C@H](CC)NC2=O)C(O)=O
: