Target
Bifunctional epoxide hydrolase 2
Ligand
BDBM50002344
Substrate
Meas. Tech.
ChEMBL_1338955 (CHEMBL3240515)
IC50
29000±n/a nM
Citation
 Amano, YYamaguchi, TTanabe, E Structural insights into binding of inhibitors to soluble epoxide hydrolase gained by fragment screening and X-ray crystallography. Bioorg Med Chem 22:2427-34 (2014)  
Target
Name:
Bifunctional epoxide hydrolase 2
Synonyms:
Cytosolic epoxide hydrolase 2 EPHX2 HYES_HUMAN Soluble epoxide hydrolase (sEH) | epoxide hydrolase 2, cytoplasmic
Type:
Enzyme
Mol. Mass.:
62613.07
Organism:
Homo sapiens (Human)
Description:
P34913
Residue:
555
  
Inhibitor
Name:
BDBM50002344
Synonyms:
CHEMBL3233607
Type:
Small organic molecule
Emp. Form.:
C10H16N4O2
Mol. Mass.:
224.2596
SMILES:
Cn1c(N)c(N2CCCCC2)c(=O)[nH]c1=O
: