Target
Cholinesterase
Ligand
BDBM50002848
Substrate
Meas. Tech.
ChEMBL_1339398 (CHEMBL3243766)
IC50
330±n/a nM
Citation
 Pudlo, MLuzet, VIsmaïli, LTomassoli, IIutzeler, ARefouvelet, B Quinolone-benzylpiperidine derivatives as novel acetylcholinesterase inhibitor and antioxidant hybrids for Alzheimer disease. Bioorg Med Chem 22:2496-507 (2014)  
Target
Name:
Cholinesterase
Synonyms:
BCHE CHLE_HORSE | Cholinesterase
Type:
Enzyme
Mol. Mass.:
65643.35
Organism:
Equus caballus (Horse)
Description:
P81908
Residue:
574
  
Inhibitor
Name:
BDBM50002848
Synonyms:
CHEMBL3233940
Type:
Small organic molecule
Emp. Form.:
C32H35N3O6
Mol. Mass.:
557.6368
SMILES:
COc1cc(Cn2c3ccccc3c(O)c(C(=O)NCC3CCN(Cc4ccccc4)CC3)c2=O)cc(OC)c1O
: