Target
Cytochrome P450 3A4
Ligand
BDBM50003562
Substrate
Meas. Tech.
ChEMBL_1335568 (CHEMBL3239423)
IC50
<300±n/a nM
Citation
 Phillips, DPGao, WYang, YZhang, GLerario, IKLau, TLJiang, JWang, XNguyen, DGBhat, BGTrotter, CSullivan, HWelzel, GLandry, JChen, YJoseph, SBLi, CGordon, WPRichmond, WJohnson, KBretz, ABursulaya, BPan, SMcNamara, PSeidel, HM Discovery of trifluoromethyl(pyrimidin-2-yl)azetidine-2-carboxamides as potent, orally bioavailable TGR5 (GPBAR1) agonists: structure-activity relationships, lead optimization, and chronic in vivo efficacy. J Med Chem 57:3263-82 (2014)  
Target
Name:
Cytochrome P450 3A4
Synonyms:
Albendazole monooxygenase CP3A4_HUMAN CYP3A4 CYPIIIA4 Cytochrome P450 3A4 (CYP3A4) Nifedipine oxidase Taurochenodeoxycholate 6-alpha-hydroxylase
Type:
Enzyme
Mol. Mass.:
57349.57
Organism:
Homo sapiens (Human)
Description:
Residue:
503
  
Inhibitor
Name:
BDBM50003562
Synonyms:
CHEMBL3234572
Type:
Small organic molecule
Emp. Form.:
C23H27F3N8O
Mol. Mass.:
488.5087
SMILES:
FC(F)(F)c1nc(cc(n1)N1CCC[C@H](C1)C(=O)NCCc1ccc(nc1)C#N)N1CCNCC1
: