Target
Cannabinoid receptor 2
Ligand
BDBM50353747
Substrate
Meas. Tech.
ChEMBL_1334657 (CHEMBL3239857)
Ki
2.9±n/a nM
Citation
 Han, SThatte, JBuzard, DJJones, RM Therapeutic utility of cannabinoid receptor type 2 (CB(2)) selective agonists. Cell Chem Biol 56:8224-56 (2013)  
Target
Name:
Cannabinoid receptor 2
Synonyms:
CANNABINOID CB2 CB2 CB2B CNR2_HUMAN Cannabinoid CB2 receptor Cannabinoid receptor 2 (CB2R) | hCB2
Type:
G Protein-Coupled Receptor (GPCR)
Mol. Mass.:
39690.94
Organism:
Homo sapiens (Human)
Description:
P34972
Residue:
360
  
Inhibitor
Name:
BDBM50353747
Synonyms:
CHEMBL561013 | JWH-018
Type:
Small organic molecule
Emp. Form.:
C24H23NO
Mol. Mass.:
341.4455
SMILES:
CCCCCn1cc(C(=O)c2cccc3ccccc23)c2ccccc12
: