Target
Cannabinoid receptor 1
Ligand
BDBM50234418
Substrate
Meas. Tech.
ChEMBL_1334665 (CHEMBL3238548)
Ki
4800±n/a nM
Citation
 Han, SThatte, JBuzard, DJJones, RM Therapeutic utility of cannabinoid receptor type 2 (CB(2)) selective agonists. Cell Chem Biol 56:8224-56 (2013)  
Target
Name:
Cannabinoid receptor 1
Synonyms:
CANN6 CB-R CNR CNR1_HUMAN Cannabinoid receptor Cannabinoid receptor 1 (brain)
Type:
G Protein-Coupled Receptor (GPCR)
Mol. Mass.:
52868.96
Organism:
Homo sapiens (Human)
Description:
P21554
Residue:
472
  
Inhibitor
Name:
BDBM50234418
Synonyms:
(2,3-Dichloro-phenyl)-[5-methoxy-2-methyl-3-(2-morpholin-4-yl-ethyl)-indol-1-yl]-methanone CHEMBL73711 L-768242
Type:
Small organic molecule
Emp. Form.:
C23H24Cl2N2O3
Mol. Mass.:
447.354
SMILES:
COc1ccc2n(C(=O)c3cccc(Cl)c3Cl)c(C)c(CCN3CCOCC3)c2c1
: