Target
Adenosine receptor A2a
Ligand
BDBM50009525
Substrate
Meas. Tech.
ChEMBL_1352071 (CHEMBL3267336)
Ki
180±n/a nM
Citation
 de Lera Ruiz, MLim, YHZheng, J Adenosine A2A receptor as a drug discovery target. J Med Chem 57:3623-50 (2014)  
Target
Name:
Adenosine receptor A2a
Synonyms:
A2A adenosine receptor (hA2A) ADENOSINE A2 ADORA2 Adenosine A2A receptor (A2AAR)
Type:
G Protein-Coupled Receptor (GPCR)
Mol. Mass.:
44716.46
Organism:
Homo sapiens (Human)
Description:
P29274
Residue:
412
  
Inhibitor
Name:
BDBM50009525
Synonyms:
2-CI Adenosine 2-Chloroado CHEMBL285819
Type:
Small organic molecule
Emp. Form.:
C10H12ClN5O4
Mol. Mass.:
301.686
SMILES:
Nc1nc(Cl)nc2n(cnc12)[C@@H]1O[C@H](CO)[C@@H](O)[C@H]1O
: