Target
Translocator protein
Ligand
BDBM50011498
Substrate
Meas. Tech.
ChEMBL_1352881 (CHEMBL3269398)
Ki
0.442000±n/a nM
Citation
 Castellano, STaliani, SViviano, MMilite, CDa Pozzo, ECosta, BBarresi, EBruno, ACosconati, SMarinelli, LGreco, GNovellino, ESbardella, GDa Settimo, FMartini, C Structure-activity relationship refinement and further assessment of 4-phenylquinazoline-2-carboxamide translocator protein ligands as antiproliferative agents in human glioblastoma tumors. J Med Chem 57:2413-28 (2014)  
Target
Name:
Translocator protein
Synonyms:
Benzodiazepine receptors; peripheral & central Mbr PBR Peripheral benzodiazepine receptor (PBR) TSPO_RAT | Tspo
Type:
Mitochondrion membrane protein
Mol. Mass.:
18945.84
Organism:
Rattus norvegicus (rat)
Description:
Competitive binding experiments were performed on rat kidney mitochondrial membranes.
Residue:
169
  
Inhibitor
Name:
BDBM50011498
Synonyms:
CHEMBL3261908
Type:
Small organic molecule
Emp. Form.:
C24H19ClN2O
Mol. Mass.:
386.873
SMILES:
CN(Cc1ccccc1)C(=O)c1cc2ccccc2c(n1)-c1ccccc1Cl
: