Target
Orexin/Hypocretin receptor type 1
Ligand
BDBM50012607
Substrate
Meas. Tech.
ChEMBL_1351465 (CHEMBL3267681)
Ki
0.500000±n/a nM
Citation
 Roecker, AJMercer, SPHarrell, CMGarson, SLFox, SVGotter, ALPrueksaritanont, TCabalu, TDCui, DLemaire, WWinrow, CJRenger, JJColeman, PJ Discovery of dual orexin receptor antagonists with rat sleep efficacy enabled by expansion of the acetonitrile-assisted/diphosgene-mediated 2,4-dichloropyrimidine synthesis. Bioorg Med Chem Lett 24:2079-85 (2014)  
Target
Name:
Orexin/Hypocretin receptor type 1
Synonyms:
HCRTR1 OX1R_HUMAN Orexin receptor type 1 (OR 1) Orexin receptor type 1 (OX1) Orexin receptor type 1 (OxR1) | Ox1r
Type:
Protein
Mol. Mass.:
47554.50
Organism:
Homo sapiens (Human)
Description:
O43613
Residue:
425
  
Inhibitor
Name:
BDBM50012607
Synonyms:
CHEMBL3260827
Type:
Small organic molecule
Emp. Form.:
C24H27N7O2
Mol. Mass.:
445.5169
SMILES:
C[C@@H]1CCN(CCN1C(=O)c1cc(C)ccc1-n1nccn1)c1ncc2c(C)c(C)oc2n1
: