Target
Acetylcholinesterase
Ligand
BDBM50013133
Substrate
Meas. Tech.
ChEMBL_1350415 (CHEMBL3268869)
Kd
30230±n/a nM
Citation
 Karade, HNValiveti, AKAcharya, JKaushik, MP Synthesis and in vitro evaluation of bis-quaternary 2-(hydroxyimino)-N-(pyridin-3-yl)acetamide derivatives as reactivators against sarin and VX inhibited human acetylcholinesterase (hAChE). Bioorg Med Chem 22:2684-91 (2014)  
Target
Name:
Acetylcholinesterase
Synonyms:
ACES_HUMAN Acetylcholinesterase (AChE) | Acetylcholinesterase (human AChE)
Type:
Enzyme
Mol. Mass.:
67792.70
Organism:
Homo sapiens (Human)
Description:
P22303
Residue:
614
  
Inhibitor
Name:
BDBM50013133
Synonyms:
CHEMBL3261987
Type:
Small organic molecule
Emp. Form.:
C19H24Br2N6O4
Mol. Mass.:
560.24
SMILES:
[Br-].[Br-].O\N=C/C(=O)Nc1ccc[n+](CCCCC[n+]2cccc(NC(=O)\C=N/O)c2)c1
: