Target
Glucocorticoid receptor
Ligand
BDBM50014546
Substrate
Meas. Tech.
ChEMBL_1350746 (CHEMBL3266131)
IC50
3.5±n/a nM
Citation
 Edman, KAhlgren, RBengtsson, MBladh, HBäckström, SDahmén, JHenriksson, KHillertz, PHulikal, VJerre, AKinchin, LKåse, CLepistö, MMile, INilsson, SSmailagic, ATaylor, JTjörnebo, AWissler, LHansson, T The discovery of potent and selective non-steroidal glucocorticoid receptor modulators, suitable for inhalation. Bioorg Med Chem Lett 24:2571-7 (2014)  
Target
Name:
Glucocorticoid receptor
Synonyms:
GCR_HUMAN GRL Glucocorticoid receptor (GRFP) Nuclear receptor subfamily 3 group C member 1
Type:
Enzyme
Mol. Mass.:
85656.87
Organism:
Homo sapiens (Human)
Description:
P04150
Residue:
777
  
Inhibitor
Name:
BDBM50014546
Synonyms:
CHEMBL3261410
Type:
Small organic molecule
Emp. Form.:
C25H28N4O2S
Mol. Mass.:
448.58
SMILES:
C[C@@H](CNc1cccc2n(ncc12)-c1ccccc1)NS(=O)(=O)c1c(C)cc(C)cc1C
: