Target
RuvB-like 1
Ligand
BDBM50015299
Substrate
Meas. Tech.
ChEMBL_1349809 (CHEMBL3268010)
IC50
9000±n/a nM
Citation
 Elkaim, JLamblin, MLaguerre, MRosenbaum, JLestienne, PEloy, LCresteil, TFelpin, FXDessolin, J Design, synthesis and biological evaluation of Pontin ATPase inhibitors through a molecular docking approach. Bioorg Med Chem Lett 24:2512-6 (2014)  
Target
Name:
RuvB-like 1
Synonyms:
49 kDa TATA box-binding protein-interacting protein 54 kDa erythrocyte cytosolic protein INO80 complex subunit H NMP 238 Nuclear matrix protein 238 RUVB1_HUMAN TAP54-alpha TIP49A | TIP60-associated protein 54-alpha
Type:
PROTEIN
Mol. Mass.:
50226.43
Organism:
Homo sapiens (Human)
Description:
ChEMBL_108308
Residue:
456
  
Inhibitor
Name:
BDBM50015299
Synonyms:
CHEMBL3263107
Type:
Small organic molecule
Emp. Form.:
C28H24N4O3
Mol. Mass.:
464.5152
SMILES:
N[C@@H](Cc1c[nH]c2ccccc12)C(=O)Nc1ccc(cc1)-c1c(O)c(c[nH]c1=O)-c1ccccc1
: