Target
Glandular kallikrein
Ligand
BDBM50016539
Substrate
Meas. Tech.
ChEMBL_1354676 (CHEMBL3281101)
Ki
1760±n/a nM
Citation
 Geratz, JDCheng, MCTidwell, RR Novel bis(benzamidino) compounds with an aromatic central link. Inhibitors of thrombin, pancreatic kallikrein, trypsin, and complement. J Med Chem 19:634-9 (1976)  
Target
Name:
Glandular kallikrein
Synonyms:
KLK_PIG | Tissue kallikrein
Type:
PROTEIN
Mol. Mass.:
26710.38
Organism:
Sus scrofa
Description:
ChEMBL_108296
Residue:
242
  
Inhibitor
Name:
BDBM50016539
Synonyms:
CHEMBL3277936
Type:
Small organic molecule
Emp. Form.:
C28H27ClN4O2
Mol. Mass.:
486.993
SMILES:
Cl.NC(=N)c1cccc(OCc2cccc(c2)-c2cccc(COc3cccc(c3)C(N)=N)c2)c1
: