Target
Sodium-dependent dopamine transporter
Ligand
BDBM50016545
Substrate
Meas. Tech.
ChEMBL_1356560 (CHEMBL3286059)
IC50
20000±n/a nM
Citation
 Tuomisto, JTuomisto, LPazdernik, TL Conformationally rigid amphetamine analogs as inhibitors of monoamine uptake by brain synaptosomes. J Med Chem 19:725-7 (1976)  
Target
Name:
Sodium-dependent dopamine transporter
Synonyms:
DA transporter SC6A3_RAT Sodium-dependent dopamine transporter | Sodium-dependent dopamine transporter (DAT)
Type:
Multi-pass membrane protein
Mol. Mass.:
68749.45
Organism:
Rattus norvegicus (rat)
Description:
P23977
Residue:
619
  
Inhibitor
Name:
BDBM50016545
Synonyms:
CHEMBL3278291
Type:
Small organic molecule
Emp. Form.:
C16H23N
Mol. Mass.:
229.3605
SMILES:
[H][C@@]12CCCC[C@@]1([H])CC(C(N)C2)c1ccccc1
: