Target
Glucocorticoid receptor
Ligand
BDBM13775
Substrate
Meas. Tech.
ChEMBL_1358464 (CHEMBL3281632)
Kd
43±n/a nM
Citation
 El Masry, AHBraun, VCNielsen, CJPratt, WB Synthesis and biological action of two glucocorticoid alkylating agents. J Med Chem 20:1134-9 (1978)  
Target
Name:
Glucocorticoid receptor
Synonyms:
GCR_MOUSE Glucocorticoid receptor Grl1 | Nr3c1
Type:
Enzyme Catalytic Domain
Mol. Mass.:
86050.26
Organism:
MOUSE
Description:
Glucocorticoid 0 MOUSE::P06537
Residue:
783
  
Inhibitor
Name:
BDBM13775
Synonyms:
(1S,2R,10S,11S,14R,15S,17S)-14,17-dihydroxy-14-(2-hydroxyacetyl)-2,15-dimethyltetracyclo[8.7.0.0^{2,7}.0^{11,15}]heptadec-6-en-5-one 3H-cortisol US10188667, Example 00023 cortisol
Type:
Steroid
Emp. Form.:
C21H30O5
Mol. Mass.:
362.4599
SMILES:
[H][C@@]12CC[C@](O)(C(=O)CO)[C@@]1(C)C[C@H](O)[C@@]1([H])[C@@]2([H])CCC2=CC(=O)CC[C@]12C
: