Target
5-hydroxytryptamine receptor 2A
Ligand
BDBM50018250
Substrate
Meas. Tech.
ChEMBL_1366808 (CHEMBL3297243)
Ki
0.700000±n/a nM
Citation
 Kolaczkowski, MMarcinkowska, MBucki, APawlowski, MMitka, KJaskowska, JKowalski, PKazek, GSiwek, AWasik, AWesolowska, AMierzejewski, PBienkowski, P Novel arylsulfonamide derivatives with 5-HT6/5-HT7 receptor antagonism targeting behavioral and psychological symptoms of dementia. J Med Chem 57:4543-57 (2014)  
Target
Name:
5-hydroxytryptamine receptor 2A
Synonyms:
5-HT-2 5-HT2A 5-hydroxytryptamine receptor 2A (5HT-2A) 5HT2A_HUMAN HTR2A | Serotonin receptor 2A
Type:
undefined
Mol. Mass.:
52607.65
Organism:
Homo sapiens (Human)
Description:
P28223
Residue:
471
  
Inhibitor
Name:
BDBM50018250
Synonyms:
CHEMBL3290016
Type:
Small organic molecule
Emp. Form.:
C25H27F2N3O3S2
Mol. Mass.:
519.627
SMILES:
Cc1c(sc2ccc(F)cc12)S(=O)(=O)NCCCCN1CCC(CC1)c1noc2cc(F)ccc12
: