Target
5-hydroxytryptamine receptor 2A
Ligand
BDBM50018248
Substrate
Meas. Tech.
ChEMBL_1366808 (CHEMBL3297243)
Ki
0.800000±n/a nM
Citation
 Kolaczkowski, MMarcinkowska, MBucki, APawlowski, MMitka, KJaskowska, JKowalski, PKazek, GSiwek, AWasik, AWesolowska, AMierzejewski, PBienkowski, P Novel arylsulfonamide derivatives with 5-HT6/5-HT7 receptor antagonism targeting behavioral and psychological symptoms of dementia. J Med Chem 57:4543-57 (2014)  
Target
Name:
5-hydroxytryptamine receptor 2A
Synonyms:
5-HT-2 5-HT2A 5-hydroxytryptamine receptor 2A (5HT-2A) 5HT2A_HUMAN HTR2A | Serotonin receptor 2A
Type:
undefined
Mol. Mass.:
52607.65
Organism:
Homo sapiens (Human)
Description:
P28223
Residue:
471
  
Inhibitor
Name:
BDBM50018248
Synonyms:
CHEMBL3290014
Type:
Small organic molecule
Emp. Form.:
C24H25ClFN3O3S2
Mol. Mass.:
522.055
SMILES:
Fc1ccc2c(noc2c1)C1CCN(CCCCNS(=O)(=O)c2cc3ccc(Cl)cc3s2)CC1
: