Target
Free fatty acid receptor 1
Ligand
BDBM50019084
Substrate
Meas. Tech.
ChEMBL_1361427 (CHEMBL3294051)
EC50
210±n/a nM
Citation
 Takano, RYoshida, MInoue, MHonda, TNakashima, RMatsumoto, KYano, TOgata, TWatanabe, NToda, N Discovery of 3-aryl-3-ethoxypropanoic acids as orally active GPR40 agonists. Bioorg Med Chem Lett 24:2949-53 (2014)  
Target
Name:
Free fatty acid receptor 1
Synonyms:
FFAR1_RAT G-protein coupled receptor 40 | Gpr40
Type:
PROTEIN
Mol. Mass.:
31848.38
Organism:
Rattus norvegicus
Description:
ChEMBL_1511162
Residue:
300
  
Inhibitor
Name:
BDBM50019084
Synonyms:
CHEMBL3288345
Type:
Small organic molecule
Emp. Form.:
C23H23NO3
Mol. Mass.:
361.4336
SMILES:
Cc1cccc(C)c1-c1cccc(COc2ccc(CCC(O)=O)nc2)c1
: