Target
Retinal rod rhodopsin-sensitive cGMP 3',5'-cyclic phosphodiesterase subunit delta
Ligand
BDBM50019860
Substrate
Meas. Tech.
ChEMBL_1361547 (CHEMBL3294871)
Kd
36±n/a nM
Citation
 Zimmermann, GSchultz-Fademrecht, CKüchler, PMurarka, SIsmail, STriola, GNussbaumer, PWittinghofer, AWaldmann, H Structure guided design and kinetic analysis of highly potent benzimidazole inhibitors targeting the PDEd prenyl binding site. J Med Chem 57:5435-48 (2014)  
Target
Name:
Retinal rod rhodopsin-sensitive cGMP 3',5'-cyclic phosphodiesterase subunit delta
Synonyms:
3',5'-cyclic phosphodiesterase PDE6D PDED Retinal rod rhodopsin-sensitive cGMP 3',5'-cyclic phosphodiesterase subunit delta
Type:
PROTEIN
Mol. Mass.:
17418.30
Organism:
Homo sapiens (Human)
Description:
ChEMBL_105761
Residue:
150
  
Inhibitor
Name:
BDBM50019860
Synonyms:
CHEMBL3286924
Type:
Small organic molecule
Emp. Form.:
C41H52FN3O7
Mol. Mass.:
717.8659
SMILES:
COCCOCCOCCCNC(=O)C[C@H](O)C[C@H](O)CCn1c(C(C)C)c(C(=O)Nc2ccccc2)c(c1-c1ccc(F)cc1)-c1ccccc1
: