Target
Prostacyclin receptor
Ligand
BDBM50020044
Substrate
Meas. Tech.
ChEMBL_1363801 (CHEMBL3294218)
IC50
1000±n/a nM
Citation
 Zhou, GZorn, NTing, PAslanian, RLin, MCook, JLachowicz, JLin, ASmith, MHwa, Jvan Heek, MWalker, S Development of novel benzomorpholine class of diacylglycerol acyltransferase I inhibitors. ACS Med Chem Lett 5:544-9 (2014)  
Target
Name:
Prostacyclin receptor
Synonyms:
PGI receptor PRIPR Prostacyclin (IP) Receptor Prostaglandin I Prostaglandin I2 receptor | Prostanoid IP receptor
Type:
G Protein-Coupled Receptor (GPCR)
Mol. Mass.:
40968.22
Organism:
Homo sapiens (Human)
Description:
The membranes prepared from human platelet were used in binding assay.
Residue:
386
  
Inhibitor
Name:
BDBM50020044
Synonyms:
CHEMBL3287898
Type:
Small organic molecule
Emp. Form.:
C32H36N2O4
Mol. Mass.:
512.6392
SMILES:
CCc1ccccc1NC(=O)N1C[C@@H](C)Oc2cc(ccc12)-c1ccc(cc1)[C@H]1CC[C@H](CC(O)=O)CC1
: