Target
Caspase-9
Ligand
BDBM50020044
Substrate
Meas. Tech.
ChEMBL_1363798 (CHEMBL3294215)
IC50
5000±n/a nM
Citation
 Zhou, GZorn, NTing, PAslanian, RLin, MCook, JLachowicz, JLin, ASmith, MHwa, Jvan Heek, MWalker, S Development of novel benzomorpholine class of diacylglycerol acyltransferase I inhibitors. ACS Med Chem Lett 5:544-9 (2014)  
Target
Name:
Caspase-9
Synonyms:
Apoptotic protease-activating factor 1/Caspase-3/Caspase-9/Cytochrome c CASP-9 CASP9_HUMAN ICE-like apoptotic protease 6 caspase-9 isoform alpha preproprotein
Type:
Enzyme
Mol. Mass.:
46277.29
Organism:
Homo sapiens (Human)
Description:
Residue:
416
  
Inhibitor
Name:
BDBM50020044
Synonyms:
CHEMBL3287898
Type:
Small organic molecule
Emp. Form.:
C32H36N2O4
Mol. Mass.:
512.6392
SMILES:
CCc1ccccc1NC(=O)N1C[C@@H](C)Oc2cc(ccc12)-c1ccc(cc1)[C@H]1CC[C@H](CC(O)=O)CC1
: