Target
Diacylglycerol O-acyltransferase 1
Ligand
BDBM50020051
Substrate
Meas. Tech.
ChEMBL_1363772 (CHEMBL3294189)
IC50
34±n/a nM
Citation
 Zhou, GZorn, NTing, PAslanian, RLin, MCook, JLachowicz, JLin, ASmith, MHwa, Jvan Heek, MWalker, S Development of novel benzomorpholine class of diacylglycerol acyltransferase I inhibitors. ACS Med Chem Lett 5:544-9 (2014)  
Target
Name:
Diacylglycerol O-acyltransferase 1
Synonyms:
DGAT1_MOUSE Dgat1 Diacylglycerol O-acyltransferase 1 (DGAT1) | Diglyceride acyltransferase
Type:
Enzyme
Mol. Mass.:
56810.61
Organism:
Mus musculus (mouse)
Description:
In this assay, recombinant mouse DGAT-1 containing an N-terminal His6-epitope tag was produced in the baculovirus expression system.
Residue:
498
  
Inhibitor
Name:
BDBM50020051
Synonyms:
CHEMBL3287874
Type:
Small organic molecule
Emp. Form.:
C31H34N2O5
Mol. Mass.:
514.6121
SMILES:
CCOc1ccc(NC(=O)N2CCOc3cc(ccc23)-c2ccc(cc2)[C@H]2CC[C@H](CC(O)=O)CC2)cc1
: