Target
Sterol O-acyltransferase 2
Ligand
BDBM50009432
Substrate
Meas. Tech.
ChEMBL_1363767 (CHEMBL3294184)
IC50
9700±n/a nM
Citation
 Zhou, GZorn, NTing, PAslanian, RLin, MCook, JLachowicz, JLin, ASmith, MHwa, Jvan Heek, MWalker, S Development of novel benzomorpholine class of diacylglycerol acyltransferase I inhibitors. ACS Med Chem Lett 5:544-9 (2014)  
Target
Name:
Sterol O-acyltransferase 2
Synonyms:
ACACT2 ACAT2 Acetyl-CoA transferase-like protein Cholesterol acyltransferase 2 SOAT2 | SOAT2_HUMAN
Type:
Enzyme
Mol. Mass.:
59912.75
Organism:
Homo sapiens (Human)
Description:
O75908
Residue:
522
  
Inhibitor
Name:
BDBM50009432
Synonyms:
CHEMBL3233884
Type:
Small organic molecule
Emp. Form.:
C29H30N2O4
Mol. Mass.:
470.5595
SMILES:
OC(=O)C[C@H]1CC[C@@H](CC1)c1ccc(cc1)-c1ccc2N(CCOc2c1)C(=O)Nc1ccccc1
: