Target
Microtubule-associated protein tau
Ligand
BDBM50020858
Substrate
Meas. Tech.
ChEMBL_1364642 (CHEMBL3291775)
IC50
5.0±n/a nM
Citation
 Blass, B Imidazo[2,1]thiazol-3-one Derivatives Useful as Diagnostic Agents for Alzheimer's Disease. ACS Med Chem Lett 5:619-20 (2014)  
Target
Name:
Microtubule-associated protein tau
Synonyms:
MAPT MTBT1 Neurofibrillary tangle protein Paired helical filament-tau TAU_HUMAN | Tau Protein
Type:
Protein
Mol. Mass.:
78928.63
Organism:
Homo sapiens (Human)
Description:
P10636
Residue:
758
  
Inhibitor
Name:
BDBM50020858
Synonyms:
CHEMBL3286981
Type:
Small organic molecule
Emp. Form.:
C19H15N3O4S
Mol. Mass.:
381.405
SMILES:
COc1cc(\C=c2/sc3nc(cn3c2=O)-c2ccncc2)cc(OC)c1O
: