Target
Tyrosine-protein kinase JAK1
Ligand
BDBM50021657
Substrate
Meas. Tech.
ChEMBL_1368152 (CHEMBL3301297)
IC50
363±n/a nM
Citation
 Clark, JDFlanagan, METelliez, JB Discovery and development of Janus kinase (JAK) inhibitors for inflammatory diseases. J Med Chem 57:5023-38 (2014)  
Target
Name:
Tyrosine-protein kinase JAK1
Synonyms:
JAK-1 JAK1A JAK1_HUMAN Janus kinase 1 (JAK1) | Janus kinase 1 JAK1
Type:
Protein
Mol. Mass.:
133293.73
Organism:
Homo sapiens (Human)
Description:
P23458
Residue:
1154
  
Inhibitor
Name:
BDBM50021657
Synonyms:
CHEMBL3297839
Type:
Small organic molecule
Emp. Form.:
C21H25N5O3S
Mol. Mass.:
427.52
SMILES:
O=C(Nc1nc2CC=CC(c3ccc(CN4CCS(=O)(=O)CC4)cc3)n2n1)C1CC1
: