Target
D(2) dopamine receptor
Ligand
BDBM50394930
Substrate
Meas. Tech.
ChEMBL_1369049 (CHEMBL3300162)
Ki
1160±n/a nM
Citation
 Szabo, MKlein Herenbrink, CChristopoulos, ALane, JRCapuano, B Structure-activity relationships of privileged structures lead to the discovery of novel biased ligands at the dopamine D2 receptor. J Med Chem 57:4924-39 (2014)  
Target
Name:
D(2) dopamine receptor
Synonyms:
D(2) dopamine receptor DOPAMINE D2 Long DRD2 Dopamine D2 receptor Dopamine D2 receptor (D2R) Dopamine2-like | d2
Type:
Cell-surface receptors
Mol. Mass.:
50647.10
Organism:
Homo sapiens (Human)
Description:
P14416
Residue:
443
  
Inhibitor
Name:
BDBM50394930
Synonyms:
CHEMBL1424807
Type:
Small organic molecule
Emp. Form.:
C10H12Cl2N2
Mol. Mass.:
231.122
SMILES:
Clc1cccc(N2CCNCC2)c1Cl
: