Target
Tyrosine-protein kinase ITK/TSK
Ligand
BDBM50022931
Substrate
Meas. Tech.
ChEMBL_1369124
IC50
410±n/a nM
Citation
 Burch, JDLau, KBarker, JJBrookfield, FChen, YChen, YEigenbrot, CEllebrandt, CIsmaili, MHJohnson, AKordt, DMacKinnon, CHMcEwan, PAOrtwine, DFStein, DBWang, XWinkler, DYuen, PWZhang, YZarrin, AAPei, Z Property- and structure-guided discovery of a tetrahydroindazole series of interleukin-2 inducible T-cell kinase inhibitors. J Med Chem 57:5714-27 (2014)  
Target
Name:
Tyrosine-protein kinase ITK/TSK
Synonyms:
EMT ITK_HUMAN LYK Tyrosine-protein kinase ITK Tyrosine-protein kinase Lyk
Type:
Protein
Mol. Mass.:
71839.20
Organism:
Homo sapiens (Human)
Description:
Q08881
Residue:
620
  
Inhibitor
Name:
BDBM50022931
Synonyms:
CHEMBL3298369
Type:
Small organic molecule
Emp. Form.:
C20H21N5O
Mol. Mass.:
347.4136
SMILES:
CC12CC1Cc1c(C2)[nH]nc1C(=O)Nc1cnn(Cc2ccccc2)c1
: