Target
Neprilysin
Ligand
BDBM50023127
Substrate
Meas. Tech.
ChEMBL_1367181
Ki
24±n/a nM
Citation
 Poras, HBonnard, EDangé, EFournié-Zaluski, MCRoques, BP New orally active dual enkephalinase inhibitors (DENKIs) for central and peripheral pain treatment. J Med Chem 57:5748-63 (2014)  
Target
Name:
Neprilysin
Synonyms:
Atriopeptidase CD_antigen=CD10 EPN MME NEP_HUMAN Neutral endopeptidase | Neutral endopeptidase 24.11
Type:
Enzyme
Mol. Mass.:
85505.38
Organism:
Homo sapiens (Human)
Description:
P08473
Residue:
750
  
Inhibitor
Name:
BDBM50023127
Synonyms:
CHEMBL3298936
Type:
Small organic molecule
Emp. Form.:
C11H15NO4S2
Mol. Mass.:
289.371
SMILES:
OC[C@H](NC(=O)C(CS)Cc1ccsc1)C(O)=O
: