Target
Aminopeptidase N
Ligand
BDBM50024594
Substrate
Meas. Tech.
ChEMBL_1442054 (CHEMBL3373422)
Ki
2.6±n/a nM
Citation
 Vassiliou, SWeglarz-Tomczak, EBerlicki, LPawelczak, MNocek, BMulligan, RJoachimiak, AMucha, A Structure-guided, single-point modifications in the phosphinic dipeptide structure yield highly potent and selective inhibitors of neutral aminopeptidases. J Med Chem 57:8140-51 (2014)  
Target
Name:
Aminopeptidase N
Synonyms:
AMPN_HUMAN APN Aminopeptidase CD_antigen=CD13 Myeloid plasma membrane glycoprotein CD13 gp150 | hAPN
Type:
PROTEIN
Mol. Mass.:
109522.63
Organism:
Homo sapiens (Human)
Description:
ChEMBL_1507526
Residue:
967
  
Inhibitor
Name:
BDBM50024594
Synonyms:
(R)-1-Ammonium-3-methyl-butane-1-phosphonic acid anion LEUCINE PHOSPHONIC ACID
Type:
Small organic molecule
Emp. Form.:
C5H14NO3P
Mol. Mass.:
167.1433
SMILES:
CC(C)C[C@H]([NH3+])P(O)([O-])=O
: